Target
Epidermal growth factor receptor [1-745,751-967]
Ligand
BDBM202385
Substrate
Meas. Tech.
Cell Based Assay
EC50
750±n/a nM
Citation
 Lee, KNiu, DPetter, RCSingh, J Heteroaryl compounds and uses thereof US Patent  US9238629 Publication Date 1/19/2016 
Target
Name:
Epidermal growth factor receptor [1-745,751-967]
Synonyms:
EGFR ERBB Epidermal growth factor receptor (EGFR) (delE746-A750) | HER1
Type:
Mol. Mass.:
106734.86
Organism:
Homo sapiens (Human)
Description:
P00533[1-745,751-967]
Residue:
962
  
Inhibitor
Name:
BDBM202385
Synonyms:
US9238629, I-17
Type:
Small organic molecule
Emp. Form.:
C21H20ClN5O3
Mol. Mass.:
425.868
SMILES:
COc1cccc(Nc2ncc(Cl)c(Nc3cccc(NC(=O)C=C)c3)n2)c1OC
: