Target
Epidermal growth factor receptor [1-745,751-967]
Ligand
BDBM202390
Substrate
Meas. Tech.
Cell Based Assay
EC50
>1000±n/a nM
Citation
 Lee, KNiu, DPetter, RCSingh, J Heteroaryl compounds and uses thereof US Patent  US9238629 Publication Date 1/19/2016 
Target
Name:
Epidermal growth factor receptor [1-745,751-967]
Synonyms:
EGFR ERBB Epidermal growth factor receptor (EGFR) (delE746-A750) | HER1
Type:
Mol. Mass.:
106734.86
Organism:
Homo sapiens (Human)
Description:
P00533[1-745,751-967]
Residue:
962
  
Inhibitor
Name:
BDBM202390
Synonyms:
US10081606, Compound I-22 US9765038, Compound I-22
Type:
Small organic molecule
Emp. Form.:
C20H18BrN5O2
Mol. Mass.:
440.293
SMILES:
COc1ccccc1Nc1ncc(Br)c(Nc2cccc(NC(=O)C=C)c2)n1
: