Target
Mitogen-activated protein kinase 1
Ligand
BDBM204415
Substrate
Meas. Tech.
Kinase Assay (New)
pH
7.5±n/a
IC50
3.57±n/a nM
Comments
extracted
Citation
 Bagdanoff, JTDing, YHan, WHuang, ZJiang, QJin, JXKou, XLee, PLindvall, MMin, ZPan, YPecchi, SPfister, KBPoon, DRauniyar, VWang, XMZhang, QZhou, JZhu, S Aminoheteroaryl benzamides as kinase inhibitors US Patent  US9242996 Publication Date 1/26/2016 
Target
Name:
Mitogen-activated protein kinase 1
Synonyms:
ERK2 Extracellular signal-regulated kinase 2 Extracellular signal-regulated kinase 2 (ERK2) MAPK 2 MK01_HUMAN Mitogen-activated protein kinase 1 (ERK-2) Mitogen-activated protein kinase 2 PRKM2 | p42-MAPK
Type:
Ser/Thr Protein Kinase
Mol. Mass.:
41392.76
Organism:
Homo sapiens (Human)
Description:
P28482
Residue:
360
  
Inhibitor
Name:
BDBM204415
Synonyms:
US9242996, 9
Type:
Small organic molecule
Emp. Form.:
C26H24ClFN4O4
Mol. Mass.:
510.945
SMILES:
Nc1ncc(cc1-c1ccc(C(=O)N[C@H](CO)c2cccc(Cl)c2)c(F)c1)[C@H]1C[C@H]2COC(=O)N2C1
: