Target
Adenosine receptor A3
Ligand
BDBM60936
Substrate
Meas. Tech.
Radioligand Binding Assays
Ki
31.8±n/a nM
Citation
 Jacobson, KAThatikonda, SKKozma, EESpalluto, GMoro, SFederico, S Fluorescent antagonists of the A3 adenosine receptor US Patent  US9227979 Publication Date 1/5/2016 
Target
Name:
Adenosine receptor A3
Synonyms:
A3 adenosine receptor (hA3) ADORA3 | Adenosine A3 receptor (A3AR)
Type:
G Protein-Coupled Receptor (GPCR)
Mol. Mass.:
36197.32
Organism:
Homo sapiens (Human)
Description:
P0DMS8
Residue:
318
  
Inhibitor
Name:
BDBM60936
Synonyms:
US9227979, MRS5763
Type:
Emp. Form.:
C44H39N13O12S2
Mol. Mass.:
1005.991
SMILES:
Cn1cc2c(n1)nc(NC(=O)CCCc1cn(CCCCCCNC(=O)c3ccc(c(c3)C([O-])=O)-c3c4ccc(N)c(c4oc4c(c(=[NH2+])ccc34)S([O-])(=O)=O)S([O-])(=O)=O)nn1)n1nc(nc21)-c1ccco1
: