Target
Adenosine receptor A3
Ligand
BDBM204874
Substrate
Meas. Tech.
Radioligand Binding Assays
Ki
8.06±n/a nM
Citation
 Jacobson, KAThatikonda, SKKozma, EESpalluto, GMoro, SFederico, S Fluorescent antagonists of the A3 adenosine receptor US Patent  US9227979 Publication Date 1/5/2016 
Target
Name:
Adenosine receptor A3
Synonyms:
A3 adenosine receptor (hA3) ADORA3 | Adenosine A3 receptor (A3AR)
Type:
G Protein-Coupled Receptor (GPCR)
Mol. Mass.:
36197.32
Organism:
Homo sapiens (Human)
Description:
P0DMS8
Residue:
318
  
Inhibitor
Name:
BDBM204874
Synonyms:
EA13/MRS5822 | US9227979, 17
Type:
Small organic molecule
Emp. Form.:
C23H25N10O3
Mol. Mass.:
489.5093
SMILES:
Cn1cc2c(n1)nc(NC(=O)Nc1ccc(CC(=O)NCCC[NH3+])cc1)n1nc(nc21)-c1ccco1
: