Target
Adenosine receptor A2a
Ligand
BDBM204855
Substrate
Meas. Tech.
Radioligand Binding Assays
Ki
460±60 nM
Citation
 Jacobson, KAThatikonda, SKKozma, EESpalluto, GMoro, SFederico, S Fluorescent antagonists of the A3 adenosine receptor US Patent  US9227979 Publication Date 1/5/2016 
Target
Name:
Adenosine receptor A2a
Synonyms:
A2A adenosine receptor (hA2A) ADENOSINE A2 ADORA2 Adenosine A2A receptor (A2AAR)
Type:
G Protein-Coupled Receptor (GPCR)
Mol. Mass.:
44716.46
Organism:
Homo sapiens (Human)
Description:
P29274
Residue:
412
  
Inhibitor
Name:
BDBM204855
Synonyms:
US9227979, 3
Type:
Small organic molecule
Emp. Form.:
C36H28N9O6S
Mol. Mass.:
714.73
SMILES:
Cn1cc2c(n1)nc(NCCCCNC(=S)Nc1ccc(c(c1)C([O-])=O)-c1c3ccc(O)cc3oc3cc(=O)ccc13)n1nc(nc21)-c1ccco1
: