Target
Adenosine receptor A1
Ligand
BDBM204861
Substrate
Meas. Tech.
Radioligand Binding Assays
Ki
87±24 nM
Citation
 Jacobson, KAThatikonda, SKKozma, EESpalluto, GMoro, SFederico, S Fluorescent antagonists of the A3 adenosine receptor US Patent  US9227979 Publication Date 1/5/2016 
Target
Name:
Adenosine receptor A1
Synonyms:
A1 adenosine receptor (hA1) AA1R_HUMAN ADORA1 Adenosine A1-receptor Adenosine receptor A1 (hA1) | Adenosine transporter (AdT)
Type:
G Protein-Coupled Receptor (GPCR)
Mol. Mass.:
36520.92
Organism:
Homo sapiens (Human)
Description:
P30542
Residue:
326
  
Inhibitor
Name:
BDBM204861
Synonyms:
MRS5449 | US9227979, 9
Type:
Small organic molecule
Emp. Form.:
C46H38ClN11O12S2
Mol. Mass.:
1036.445
SMILES:
Nc1ccc2c(-c3ccc(cc3C([O-])=O)C(=O)NCCCCCCn3cc(CCCC(=O)Nc4nc5ccc(Cl)cc5c5nc(nn45)-c4ccco4)nn3)c3ccc(=[NH2+])c(c3oc2c1S([O-])(=O)=O)S([O-])(=O)=O
: