Target
Adenosine receptor A2a
Ligand
BDBM204861
Substrate
Meas. Tech.
Radioligand Binding Assays
Ki
73±8 nM
Citation
 Jacobson, KAThatikonda, SKKozma, EESpalluto, GMoro, SFederico, S Fluorescent antagonists of the A3 adenosine receptor US Patent  US9227979 Publication Date 1/5/2016 
Target
Name:
Adenosine receptor A2a
Synonyms:
A2A adenosine receptor (hA2A) ADENOSINE A2 ADORA2 Adenosine A2A receptor (A2AAR)
Type:
G Protein-Coupled Receptor (GPCR)
Mol. Mass.:
44716.46
Organism:
Homo sapiens (Human)
Description:
P29274
Residue:
412
  
Inhibitor
Name:
BDBM204861
Synonyms:
MRS5449 | US9227979, 9
Type:
Small organic molecule
Emp. Form.:
C46H38ClN11O12S2
Mol. Mass.:
1036.445
SMILES:
Nc1ccc2c(-c3ccc(cc3C([O-])=O)C(=O)NCCCCCCn3cc(CCCC(=O)Nc4nc5ccc(Cl)cc5c5nc(nn45)-c4ccco4)nn3)c3ccc(=[NH2+])c(c3oc2c1S([O-])(=O)=O)S([O-])(=O)=O
: