Target
Adenosine receptor A2a
Ligand
BDBM204864
Substrate
Meas. Tech.
Radioligand Binding Assays
Ki
304±20 nM
Citation
 Jacobson, KAThatikonda, SKKozma, EESpalluto, GMoro, SFederico, S Fluorescent antagonists of the A3 adenosine receptor US Patent  US9227979 Publication Date 1/5/2016 
Target
Name:
Adenosine receptor A2a
Synonyms:
A2A adenosine receptor (hA2A) ADENOSINE A2 ADORA2 Adenosine A2A receptor (A2AAR)
Type:
G Protein-Coupled Receptor (GPCR)
Mol. Mass.:
44716.46
Organism:
Homo sapiens (Human)
Description:
P29274
Residue:
412
  
Inhibitor
Name:
BDBM204864
Synonyms:
EA15/MRS5824 | US9227979, 13
Type:
Small organic molecule
Emp. Form.:
C29H33N9O5
Mol. Mass.:
587.6296
SMILES:
Cn1cc2c(n1)nc(NC(=O)Nc1ccc(CC(=O)NCCCCC(=O)OC(C)(C)C)cc1)n1nc(nc21)-c1ccco1
: