Target
Adenosine receptor A2a
Ligand
BDBM204866
Substrate
Meas. Tech.
Radioligand Binding Assays
Ki
456±96 nM
Citation
 Jacobson, KAThatikonda, SKKozma, EESpalluto, GMoro, SFederico, S Fluorescent antagonists of the A3 adenosine receptor US Patent  US9227979 Publication Date 1/5/2016 
Target
Name:
Adenosine receptor A2a
Synonyms:
A2A adenosine receptor (hA2A) ADENOSINE A2 ADORA2 Adenosine A2A receptor (A2AAR)
Type:
G Protein-Coupled Receptor (GPCR)
Mol. Mass.:
44716.46
Organism:
Homo sapiens (Human)
Description:
P29274
Residue:
412
  
Inhibitor
Name:
BDBM204866
Synonyms:
EA3/MRS5812 | US9227979, 15
Type:
Small organic molecule
Emp. Form.:
C31H37N9O7
Mol. Mass.:
647.6816
SMILES:
Cn1cc2c(n1)nc(NC(=O)Nc1ccc(CC(=O)NCCOOCCCCC(=O)OC(C)(C)C)cc1)n1nc(nc21)-c1ccco1
: