Target
Adenosine receptor A2a
Ligand
BDBM204870
Substrate
Meas. Tech.
Radioligand Binding Assays
Ki
203±52 nM
Citation
 Jacobson, KAThatikonda, SKKozma, EESpalluto, GMoro, SFederico, S Fluorescent antagonists of the A3 adenosine receptor US Patent  US9227979 Publication Date 1/5/2016 
Target
Name:
Adenosine receptor A2a
Synonyms:
A2A adenosine receptor (hA2A) ADENOSINE A2 ADORA2 Adenosine A2A receptor (A2AAR)
Type:
G Protein-Coupled Receptor (GPCR)
Mol. Mass.:
44716.46
Organism:
Homo sapiens (Human)
Description:
P29274
Residue:
412
  
Inhibitor
Name:
BDBM204870
Synonyms:
EA7/MRS5816 | US9227979, 19
Type:
Small organic molecule
Emp. Form.:
C25H29N10O3
Mol. Mass.:
517.5624
SMILES:
Cn1cc2c(n1)nc(NC(=O)Nc1ccc(CC(=O)NCCCCC[NH3+])cc1)n1nc(nc21)-c1ccco1
: