Target
Adenosine receptor A2a
Ligand
BDBM204872
Substrate
Meas. Tech.
Radioligand Binding Assays
Ki
328±77 nM
Citation
 Jacobson, KAThatikonda, SKKozma, EESpalluto, GMoro, SFederico, S Fluorescent antagonists of the A3 adenosine receptor US Patent  US9227979 Publication Date 1/5/2016 
Target
Name:
Adenosine receptor A2a
Synonyms:
A2A adenosine receptor (hA2A) ADENOSINE A2 ADORA2 Adenosine A2A receptor (A2AAR)
Type:
G Protein-Coupled Receptor (GPCR)
Mol. Mass.:
44716.46
Organism:
Homo sapiens (Human)
Description:
P29274
Residue:
412
  
Inhibitor
Name:
BDBM204872
Synonyms:
EA10/MRS5819 | US9227979, 21
Type:
Small organic molecule
Emp. Form.:
C30H39N10O6
Mol. Mass.:
635.6935
SMILES:
Cn1cc2c(n1)nc(NC(=O)Nc1ccc(CC(=O)NCCCOCCOOCCCCC[NH3+])cc1)n1nc(nc21)-c1ccco1
: