Target
Adenosine receptor A2a
Ligand
BDBM204873
Substrate
Meas. Tech.
Radioligand Binding Assays
Ki
110±18 nM
Citation
 Jacobson, KAThatikonda, SKKozma, EESpalluto, GMoro, SFederico, S Fluorescent antagonists of the A3 adenosine receptor US Patent  US9227979 Publication Date 1/5/2016 
Target
Name:
Adenosine receptor A2a
Synonyms:
A2A adenosine receptor (hA2A) ADENOSINE A2 ADORA2 Adenosine A2A receptor (A2AAR)
Type:
G Protein-Coupled Receptor (GPCR)
Mol. Mass.:
44716.46
Organism:
Homo sapiens (Human)
Description:
P29274
Residue:
412
  
Inhibitor
Name:
BDBM204873
Synonyms:
EA14/MRS5823 | US9227979, 22
Type:
Small organic molecule
Emp. Form.:
C44H34N11O8S
Mol. Mass.:
876.875
SMILES:
Cn1cc2c(n1)nc(NC(=O)Nc1ccc(CC(=O)NCCCNC(=S)Nc3ccc(c(c3)C([O-])=O)-c3c4ccc(O)cc4oc4cc(=O)ccc34)cc1)n1nc(nc21)-c1ccco1
: