Target
Adenosine receptor A2a
Ligand
BDBM204879
Substrate
Meas. Tech.
Radioligand Binding Assays
Ki
199±0 nM
Citation
 Jacobson, KAThatikonda, SKKozma, EESpalluto, GMoro, SFederico, S Fluorescent antagonists of the A3 adenosine receptor US Patent  US9227979 Publication Date 1/5/2016 
Target
Name:
Adenosine receptor A2a
Synonyms:
A2A adenosine receptor (hA2A) ADENOSINE A2 ADORA2 Adenosine A2A receptor (A2AAR)
Type:
G Protein-Coupled Receptor (GPCR)
Mol. Mass.:
44716.46
Organism:
Homo sapiens (Human)
Description:
P29274
Residue:
412
  
Inhibitor
Name:
BDBM204879
Synonyms:
MRS5846/5762 5-hex-5-ynamide | US9227979, 37
Type:
Small organic molecule
Emp. Form.:
C17H15N7O2
Mol. Mass.:
349.3467
SMILES:
Cn1cc2c(n1)nc(NC(=O)CCCC#C)n1nc(nc21)-c1ccco1
: