Target
Adenosine receptor A3
Ligand
BDBM204862
Substrate
Meas. Tech.
Radioligand Binding Assays
Ki
128±26 nM
Citation
 Jacobson, KAThatikonda, SKKozma, EESpalluto, GMoro, SFederico, S Fluorescent antagonists of the A3 adenosine receptor US Patent  US9227979 Publication Date 1/5/2016 
Target
Name:
Adenosine receptor A3
Synonyms:
A3 adenosine receptor (hA3) ADORA3 | Adenosine A3 receptor (A3AR)
Type:
G Protein-Coupled Receptor (GPCR)
Mol. Mass.:
36197.32
Organism:
Homo sapiens (Human)
Description:
P0DMS8
Residue:
318
  
Inhibitor
Name:
BDBM204862
Synonyms:
EA2/MRS5811 | US9227979, 11
Type:
Small organic molecule
Emp. Form.:
C20H16N8O4
Mol. Mass.:
432.3922
SMILES:
Cn1cc2c(n1)nc(NC(=O)Nc1ccc(CC(O)=O)cc1)n1nc(nc21)-c1ccco1
: