Target
Adenosine receptor A3
Ligand
BDBM204864
Substrate
Meas. Tech.
Radioligand Binding Assays
Ki
3.46±0.33 nM
Citation
 Jacobson, KAThatikonda, SKKozma, EESpalluto, GMoro, SFederico, S Fluorescent antagonists of the A3 adenosine receptor US Patent  US9227979 Publication Date 1/5/2016 
Target
Name:
Adenosine receptor A3
Synonyms:
A3 adenosine receptor (hA3) ADORA3 | Adenosine A3 receptor (A3AR)
Type:
G Protein-Coupled Receptor (GPCR)
Mol. Mass.:
36197.32
Organism:
Homo sapiens (Human)
Description:
P0DMS8
Residue:
318
  
Inhibitor
Name:
BDBM204864
Synonyms:
EA15/MRS5824 | US9227979, 13
Type:
Small organic molecule
Emp. Form.:
C29H33N9O5
Mol. Mass.:
587.6296
SMILES:
Cn1cc2c(n1)nc(NC(=O)Nc1ccc(CC(=O)NCCCCC(=O)OC(C)(C)C)cc1)n1nc(nc21)-c1ccco1
: