Target
Adenosine receptor A3
Ligand
BDBM204867
Substrate
Meas. Tech.
Radioligand Binding Assays
Ki
82.4±20.1 nM
Citation
 Jacobson, KAThatikonda, SKKozma, EESpalluto, GMoro, SFederico, S Fluorescent antagonists of the A3 adenosine receptor US Patent  US9227979 Publication Date 1/5/2016 
Target
Name:
Adenosine receptor A3
Synonyms:
A3 adenosine receptor (hA3) ADORA3 | Adenosine A3 receptor (A3AR)
Type:
G Protein-Coupled Receptor (GPCR)
Mol. Mass.:
36197.32
Organism:
Homo sapiens (Human)
Description:
P0DMS8
Residue:
318
  
Inhibitor
Name:
BDBM204867
Synonyms:
EA9/MRS5818 | US9227979, 16
Type:
Small organic molecule
Emp. Form.:
C35H46N10O8
Mol. Mass.:
734.8019
SMILES:
Cn1cc2c(n1)nc(NC(=O)Nc1ccc(CC(=O)NCCCOCCOOCCCCCNC(=O)OC(C)(C)C)cc1)n1nc(nc21)-c1ccco1
: