Target
Adenosine receptor A3
Ligand
BDBM204870
Substrate
Meas. Tech.
Radioligand Binding Assays
Ki
2.66±0.48 nM
Citation
 Jacobson, KAThatikonda, SKKozma, EESpalluto, GMoro, SFederico, S Fluorescent antagonists of the A3 adenosine receptor US Patent  US9227979 Publication Date 1/5/2016 
Target
Name:
Adenosine receptor A3
Synonyms:
A3 adenosine receptor (hA3) ADORA3 | Adenosine A3 receptor (A3AR)
Type:
G Protein-Coupled Receptor (GPCR)
Mol. Mass.:
36197.32
Organism:
Homo sapiens (Human)
Description:
P0DMS8
Residue:
318
  
Inhibitor
Name:
BDBM204870
Synonyms:
EA7/MRS5816 | US9227979, 19
Type:
Small organic molecule
Emp. Form.:
C25H29N10O3
Mol. Mass.:
517.5624
SMILES:
Cn1cc2c(n1)nc(NC(=O)Nc1ccc(CC(=O)NCCCCC[NH3+])cc1)n1nc(nc21)-c1ccco1
: