Target
Adenosine receptor A3
Ligand
BDBM204875
Substrate
Meas. Tech.
Radioligand Binding Assays
Ki
96.7±26.9 nM
Citation
 Jacobson, KAThatikonda, SKKozma, EESpalluto, GMoro, SFederico, S Fluorescent antagonists of the A3 adenosine receptor US Patent  US9227979 Publication Date 1/5/2016 
Target
Name:
Adenosine receptor A3
Synonyms:
A3 adenosine receptor (hA3) ADORA3 | Adenosine A3 receptor (A3AR)
Type:
G Protein-Coupled Receptor (GPCR)
Mol. Mass.:
36197.32
Organism:
Homo sapiens (Human)
Description:
P0DMS8
Residue:
318
  
Inhibitor
Name:
BDBM204875
Synonyms:
EA8/MRS5817 | US9227979, 24
Type:
Small organic molecule
Emp. Form.:
C46H38N11O8S
Mol. Mass.:
904.928
SMILES:
Cn1cc2c(n1)nc(NC(=O)Nc1ccc(CC(=O)NCCCCCNC(=S)Nc3ccc(c(c3)C([O-])=O)-c3c4ccc(O)cc4oc4cc(=O)ccc34)cc1)n1nc(nc21)-c1ccco1
: