Target
Adenosine receptor A3
Ligand
BDBM204878
Substrate
Meas. Tech.
Radioligand Binding Assays
Ki
11±0.6 nM
Citation
 Jacobson, KAThatikonda, SKKozma, EESpalluto, GMoro, SFederico, S Fluorescent antagonists of the A3 adenosine receptor US Patent  US9227979 Publication Date 1/5/2016 
Target
Name:
Adenosine receptor A3
Synonyms:
A3 adenosine receptor (hA3) ADORA3 | Adenosine A3 receptor (A3AR)
Type:
G Protein-Coupled Receptor (GPCR)
Mol. Mass.:
36197.32
Organism:
Homo sapiens (Human)
Description:
P0DMS8
Residue:
318
  
Inhibitor
Name:
BDBM204878
Synonyms:
EA19(5-pent-4-ynamide)/MRS5811 | US9227979, 36
Type:
Small organic molecule
Emp. Form.:
C16H13N7O2
Mol. Mass.:
335.3201
SMILES:
Cn1cc2c(n1)nc(NC(=O)CCC#C)n1nc(nc21)-c1ccco1
: