Target
Adenosine receptor A3
Ligand
BDBM204879
Substrate
Meas. Tech.
Radioligand Binding Assays
Ki
4.11±0.93 nM
Citation
 Jacobson, KAThatikonda, SKKozma, EESpalluto, GMoro, SFederico, S Fluorescent antagonists of the A3 adenosine receptor US Patent  US9227979 Publication Date 1/5/2016 
Target
Name:
Adenosine receptor A3
Synonyms:
A3 adenosine receptor (hA3) ADORA3 | Adenosine A3 receptor (A3AR)
Type:
G Protein-Coupled Receptor (GPCR)
Mol. Mass.:
36197.32
Organism:
Homo sapiens (Human)
Description:
P0DMS8
Residue:
318
  
Inhibitor
Name:
BDBM204879
Synonyms:
MRS5846/5762 5-hex-5-ynamide | US9227979, 37
Type:
Small organic molecule
Emp. Form.:
C17H15N7O2
Mol. Mass.:
349.3467
SMILES:
Cn1cc2c(n1)nc(NC(=O)CCCC#C)n1nc(nc21)-c1ccco1
: