Target
Adenosine receptor A3
Ligand
BDBM204880
Substrate
Meas. Tech.
Radioligand Binding Assays
Ki
7.26±1.04 nM
Citation
 Jacobson, KAThatikonda, SKKozma, EESpalluto, GMoro, SFederico, S Fluorescent antagonists of the A3 adenosine receptor US Patent  US9227979 Publication Date 1/5/2016 
Target
Name:
Adenosine receptor A3
Synonyms:
A3 adenosine receptor (hA3) ADORA3 | Adenosine A3 receptor (A3AR)
Type:
G Protein-Coupled Receptor (GPCR)
Mol. Mass.:
36197.32
Organism:
Homo sapiens (Human)
Description:
P0DMS8
Residue:
318
  
Inhibitor
Name:
BDBM204880
Synonyms:
EA18(5-hept-6-ynamide)/MRS5838 | US9227979, 38
Type:
Small organic molecule
Emp. Form.:
C18H17N7O2
Mol. Mass.:
363.3733
SMILES:
Cn1cc2c(n1)nc(NC(=O)CCCCC#C)n1nc(nc21)-c1ccco1
: