Target
Gamma-enolase
Ligand
BDBM204923
Substrate
Meas. Tech.
Enolase Enzymatic Assays
pH
7.4±n/a
IC50
62.3±0.0 nM
Comments
extracted
Citation
 Leonard, PGSatani, NMaxwell, DLin, YHHammoudi, NPeng, ZPisaneschi, FLink, TMLee, GRSun, DPrasad, BADi Francesco, MECzako, BAsara, JMWang, YABornmann, WDePinho, RAMuller, FL SF2312 is a natural phosphonate inhibitor of enolase. Nat Chem Biol 12:1053-1058 (2016)  
Target
Name:
Gamma-enolase
Synonyms:
ENO2 Enolase 2 (ENO2) | hENO2 human recombinant Enolase
Type:
Mol. Mass.:
47252.90
Organism:
Homo sapiens (Human)
Description:
Q6FHV6
Residue:
434
  
Inhibitor
Name:
BDBM204923
Synonyms:
phosphonoacetohydroxamate (PhAH)
Type:
Small organic molecule
Emp. Form.:
C2H6NO5P
Mol. Mass.:
155.0465
SMILES:
ONC(=O)CP(O)(O)=O
: