Target
Gamma-enolase
Ligand
BDBM204924
Substrate
Meas. Tech.
Enolase Enzymatic Assays
pH
7.4±n/a
IC50
42.5±0.0 nM
Comments
extracted
Citation
 Leonard, PGSatani, NMaxwell, DLin, YHHammoudi, NPeng, ZPisaneschi, FLink, TMLee, GRSun, DPrasad, BADi Francesco, MECzako, BAsara, JMWang, YABornmann, WDePinho, RAMuller, FL SF2312 is a natural phosphonate inhibitor of enolase. Nat Chem Biol 12:1053-1058 (2016)  
Target
Name:
Gamma-enolase
Synonyms:
ENO2 Enolase 2 (ENO2) | hENO2 human recombinant Enolase
Type:
Mol. Mass.:
47252.90
Organism:
Homo sapiens (Human)
Description:
Q6FHV6
Residue:
434
  
Inhibitor
Name:
BDBM204924
Synonyms:
SF2312
Type:
Small organic molecule
Emp. Form.:
C4H8NO6P
Mol. Mass.:
197.0832
SMILES:
O[C@H]1C[C@@H](C(=O)N1O)P(O)(O)=O
: