Target
Bromodomain-containing protein 4 [44-168]
Ligand
BDBM205436
Substrate
Meas. Tech.
AlphaScreen BRD Binding Assay
pH
7.5±n/a
Temperature
298.15±n/a K
IC50
404±0.0 nM
Comments
extracted
Citation
 Tanaka, MRoberts, JMSeo, HSSouza, APaulk, JScott, TGDeAngelo, SLDhe-Paganon, SBradner, JE Design and characterization of bivalent BET inhibitors. Nat Chem Biol 12:1089-1096 (2016)  
Target
Name:
Bromodomain-containing protein 4 [44-168]
Synonyms:
BET bromodomain 4(1) (BRD4(1)) BRD4-BD1 protein (aa 44-168) Bromodomain protein 4 (BRD4-BD1) Bromodomain-containing protein 4 (BRD4) (aa 44-168) Bromodomain-containing protein 4 bromodomain 1 (BRD4-BD1) | HUNK1
Type:
Enzyme Catalytic Domain
Mol. Mass.:
14866.49
Organism:
Homo sapiens (Human)
Description:
aa (44-168)
Residue:
125
  
Inhibitor
Name:
BDBM205436
Synonyms:
6S+IBET-PEG0 (17)
Type:
Small organic molecule
Emp. Form.:
C46H44ClN11O5S
Mol. Mass.:
898.43
SMILES:
COc1cc2c3n([C@H](C)c4ccccn4)c(=O)n(CC(=O)NCCNC(=O)C[C@@H]4N=C(c5c(C)c(C)sc5-n5c(C)nnc45)c4ccc(Cl)cc4)c3cnc2cc1-c1c(C)noc1C
: