Target
Bromodomain testis-specific protein [21-137]
Ligand
BDBM205444
Substrate
Meas. Tech.
AlphaScreen BRD Binding Assay
pH
7.5±n/a
Temperature
298.15±n/a K
IC50
40.3±0.0 nM
Comments
extracted
Citation
 Tanaka, MRoberts, JMSeo, HSSouza, APaulk, JScott, TGDeAngelo, SLDhe-Paganon, SBradner, JE Design and characterization of bivalent BET inhibitors. Nat Chem Biol 12:1089-1096 (2016)  
Target
Name:
Bromodomain testis-specific protein [21-137]
Synonyms:
BRDT Bromodomain testis 1 (BRDT(1))
Type:
Mol. Mass.:
13934.55
Organism:
Homo sapiens (Human)
Description:
Q58F21 (BRDT, 21-137)
Residue:
117
  
Inhibitor
Name:
BDBM205444
Synonyms:
2S+IBET-PEG1 (24)
Type:
Small organic molecule
Emp. Form.:
C49H48ClN11O8S
Mol. Mass.:
986.492
SMILES:
COC(=O)CC1N=C(c2c(C)c(sc2-n2c(C)nnc12)C(=O)NCCOCCNC(=O)Cn1c2cnc3cc(-c4c(C)noc4C)c(OC)cc3c2n([C@H](C)c2ccccn2)c1=O)c1ccc(Cl)cc1
: