Target
Bromodomain-containing protein 4 [44-168]
Ligand
BDBM205448
Substrate
Meas. Tech.
AlphaScreen BRD Binding Assay
pH
7.5±n/a
Temperature
298.15±n/a K
IC50
209±0.0 nM
Comments
extracted
Citation
 Tanaka, MRoberts, JMSeo, HSSouza, APaulk, JScott, TGDeAngelo, SLDhe-Paganon, SBradner, JE Design and characterization of bivalent BET inhibitors. Nat Chem Biol 12:1089-1096 (2016)  
Target
Name:
Bromodomain-containing protein 4 [44-168]
Synonyms:
BET bromodomain 4(1) (BRD4(1)) BRD4-BD1 protein (aa 44-168) Bromodomain protein 4 (BRD4-BD1) Bromodomain-containing protein 4 (BRD4) (aa 44-168) Bromodomain-containing protein 4 bromodomain 1 (BRD4-BD1) | HUNK1
Type:
Enzyme Catalytic Domain
Mol. Mass.:
14866.49
Organism:
Homo sapiens (Human)
Description:
aa (44-168)
Residue:
125
  
Inhibitor
Name:
BDBM205448
Synonyms:
IBETx2-PEG0 (29)
Type:
Small organic molecule
Emp. Form.:
C52H50N12O8
Mol. Mass.:
971.029
SMILES:
COc1cc2c3n([C@@H](C)c4ccccn4)c(=O)n(CC(=O)NCCNC(=O)Cn4c5cnc6cc(-c7c(C)noc7C)c(OC)cc6c5n([C@H](C)c5ccccn5)c4=O)c3cnc2cc1-c1c(C)noc1C
: