Target
Bromodomain-containing protein 4 [44-168]
Ligand
BDBM205429
Substrate
Meas. Tech.
AlphaScreen BRD Binding Assay
pH
7.5±n/a
Temperature
298.15±n/a K
IC50
21±0.0 nM
Comments
extracted
Citation
 Tanaka, MRoberts, JMSeo, HSSouza, APaulk, JScott, TGDeAngelo, SLDhe-Paganon, SBradner, JE Design and characterization of bivalent BET inhibitors. Nat Chem Biol 12:1089-1096 (2016)  
Target
Name:
Bromodomain-containing protein 4 [44-168]
Synonyms:
BET bromodomain 4(1) (BRD4(1)) BRD4-BD1 protein (aa 44-168) Bromodomain protein 4 (BRD4-BD1) Bromodomain-containing protein 4 (BRD4) (aa 44-168) Bromodomain-containing protein 4 bromodomain 1 (BRD4-BD1) | HUNK1
Type:
Enzyme Catalytic Domain
Mol. Mass.:
14866.49
Organism:
Homo sapiens (Human)
Description:
aa (44-168)
Residue:
125
  
Inhibitor
Name:
BDBM205429
Synonyms:
(R)-JQ1 (3) US10925881, Name (R)-JQ1 US11117865, Compound JQ1 US11406645, Compound JQ1 US11890288, Compound (+)-JQ1 | US9320741, (R)-JQ1
Type:
Small organic molecule
Emp. Form.:
C23H25ClN4O2S
Mol. Mass.:
456.988
SMILES:
Cc1nnc2[C@@H](CC(=O)OC(C)(C)C)N=C(c3c(C)c(C)sc3-n12)c1ccc(Cl)cc1
: