Target
Large envelope protein
Ligand
BDBM289774
Substrate
Meas. Tech.
HBSAg ELISA assay
EC50
0.300±n/a nM
Citation
 Fu, JJin, XLee, PLu, PYoung, JM Tetracyclic pyridone compounds as antivirals US Patent  US10093673 Publication Date 10/9/2018 
Target
Name:
Large envelope protein
Synonyms:
HBSAG_HBVD3 | S
Type:
Mol. Mass.:
42772.52
Organism:
Hepatitis B virus
Description:
P03138
Residue:
389
  
Inhibitor
Name:
BDBM289774
Synonyms:
US10093673, Compound 4.1
Type:
Small organic molecule
Emp. Form.:
C23H27NO7
Mol. Mass.:
429.463
SMILES:
COCCCOc1cc2[C@H]3OCC(C)(C)[C@H]3n3cc(C(O)=O)c(=O)cc3-c2cc1OC
: