Target
Delta-type opioid receptor
Ligand
BDBM50090731
Substrate
Meas. Tech.
Ligand Binding Assays
pH
7.4±n/a
Temperature
298.15±n/a K
Ki
0.4±n/a nM
Comments
extracted
Citation
 Lewis, JHusbands, S Orvinol and thevinol derivatives useful in the treatment of depression US Patent  US9259422 Publication Date 2/16/2016 
Target
Name:
Delta-type opioid receptor
Synonyms:
Cytochrome P450 3A4 Delta opioid receptor Delta-type opioid receptor (DOR) OPRD_RAT Opioid receptor Opioid receptors; mu & delta Ror-a | Voltage-gated potassium channel
Type:
G Protein-Coupled Receptor (GPCR)
Mol. Mass.:
40465.04
Organism:
Rattus norvegicus (rat)
Description:
Competition binding assays were using CHO-K1 cell membranes expressing the opioid receptor.
Residue:
372
  
Inhibitor
Name:
BDBM50090731
Synonyms:
CHEMBL3581741 US9480684, 22, R = 3- MePh- BU10112
Type:
Small organic molecule
Emp. Form.:
C32H37NO4
Mol. Mass.:
499.6405
SMILES:
[H][C@@]12Oc3c4c(C[C@@]5([H])N(CC6CC6)CC[C@@]14[C@]51C[C@](C)([C@H](O)c4cccc(C)c4)[C@]2(OC)C=C1)ccc3O
: