Target
cAMP and cAMP-inhibited cGMP 3',5'-cyclic phosphodiesterase 10A
Ligand
BDBM206867
Substrate
Meas. Tech.
In Vitro Assay hPDE10a
IC50
2±n/a nM
Citation
 Player, MRMeegalla, SKIllig, CRChen, JWilson, KJLee, YParks, DJHuang, HPatel, SLu, T PDE10a inhibitors for the treatment of type II diabetes US Patent  US9249163 Publication Date 2/2/2016 
Target
Name:
cAMP and cAMP-inhibited cGMP 3',5'-cyclic phosphodiesterase 10A
Synonyms:
3',5'-cyclic phosphodiesterase PDE10A Phosphodiesterase 10 (PDE10) | Phosphodiesterase 10A
Type:
Protein
Mol. Mass.:
88412.52
Organism:
Homo sapiens (Human)
Description:
Q9Y233
Residue:
1055
  
Inhibitor
Name:
BDBM206867
Synonyms:
US9249163, 8
Type:
Small organic molecule
Emp. Form.:
C22H18N5O3
Mol. Mass.:
400.4106
SMILES:
[O-]C(=O)c1cc(\C=C\c2cn3ccnc(N4CCOCC4)c3n2)nc2ccccc12
: