Target
cAMP and cAMP-inhibited cGMP 3',5'-cyclic phosphodiesterase 10A
Ligand
BDBM206895
Substrate
Meas. Tech.
In Vitro Assay hPDE10a
IC50
7±n/a nM
Citation
 Player, MRMeegalla, SKIllig, CRChen, JWilson, KJLee, YParks, DJHuang, HPatel, SLu, T PDE10a inhibitors for the treatment of type II diabetes US Patent  US9249163 Publication Date 2/2/2016 
Target
Name:
cAMP and cAMP-inhibited cGMP 3',5'-cyclic phosphodiesterase 10A
Synonyms:
3',5'-cyclic phosphodiesterase PDE10A Phosphodiesterase 10 (PDE10) | Phosphodiesterase 10A
Type:
Protein
Mol. Mass.:
88412.52
Organism:
Homo sapiens (Human)
Description:
Q9Y233
Residue:
1055
  
Inhibitor
Name:
BDBM206895
Synonyms:
US9249163, 79
Type:
Small organic molecule
Emp. Form.:
C27H24N8O2
Mol. Mass.:
492.5319
SMILES:
Oc1nc2ncc(cc2[nH]1)-c1cnc(N2CCOCC2)c2nc(CCc3ccc4ccccc4n3)cn12
: