Target
cAMP and cAMP-inhibited cGMP 3',5'-cyclic phosphodiesterase 10A
Ligand
BDBM206898
Substrate
Meas. Tech.
In Vitro Assay hPDE10a
IC50
1±n/a nM
Citation
 Player, MRMeegalla, SKIllig, CRChen, JWilson, KJLee, YParks, DJHuang, HPatel, SLu, T PDE10a inhibitors for the treatment of type II diabetes US Patent  US9249163 Publication Date 2/2/2016 
Target
Name:
cAMP and cAMP-inhibited cGMP 3',5'-cyclic phosphodiesterase 10A
Synonyms:
3',5'-cyclic phosphodiesterase PDE10A Phosphodiesterase 10 (PDE10) | Phosphodiesterase 10A
Type:
Protein
Mol. Mass.:
88412.52
Organism:
Homo sapiens (Human)
Description:
Q9Y233
Residue:
1055
  
Inhibitor
Name:
BDBM206898
Synonyms:
US9249163, 87
Type:
Small organic molecule
Emp. Form.:
C26H24N6O4S
Mol. Mass.:
516.572
SMILES:
NS(=O)(=O)c1ccc(cc1)-c1cnc(N2CCOCC2)c2nc(COc3ccc4ccccc4n3)cn12
: