Target
cAMP and cAMP-inhibited cGMP 3',5'-cyclic phosphodiesterase 10A
Ligand
BDBM206789
Substrate
Meas. Tech.
In Vitro Assay hPDE10a
IC50
1±n/a nM
Citation
 Player, MRMeegalla, SKIllig, CRChen, JWilson, KJLee, YParks, DJHuang, HPatel, SLu, T PDE10a inhibitors for the treatment of type II diabetes US Patent  US9249163 Publication Date 2/2/2016 
Target
Name:
cAMP and cAMP-inhibited cGMP 3',5'-cyclic phosphodiesterase 10A
Synonyms:
3',5'-cyclic phosphodiesterase PDE10A Phosphodiesterase 10 (PDE10) | Phosphodiesterase 10A
Type:
Protein
Mol. Mass.:
88412.52
Organism:
Homo sapiens (Human)
Description:
Q9Y233
Residue:
1055
  
Inhibitor
Name:
BDBM206789
Synonyms:
US9249163, 97
Type:
Small organic molecule
Emp. Form.:
C26H22N10O2
Mol. Mass.:
506.5187
SMILES:
C(Oc1ccc2ccccc2n1)c1cn2c(cnc(N3CCOCC3)c2n1)-c1ccc(nc1)-c1nnn[nH]1
: