Target
Tyrosine-protein kinase BTK
Ligand
BDBM208976
Substrate
Meas. Tech.
Caliper-Based Kinase Assay
Temperature
298.15±n/a K
IC50
5.6±n/a nM
Comments
extracted
Citation
 Owens, TVerner, E Substituted pyrazolo[3,4-d]pyrimidines as kinase inhibitors US Patent  US9266895 Publication Date 2/23/2016 
Target
Name:
Tyrosine-protein kinase BTK
Synonyms:
AGMX1 Agammaglobulinaemia tyrosine kinase B cell progenitor kinase BPK BTK_HUMAN Tyrosine Kinase BTK Tyrosine-protein kinase BTK (BTK)
Type:
Enzyme
Mol. Mass.:
76289.95
Organism:
Homo sapiens (Human)
Description:
Q06187
Residue:
659
  
Inhibitor
Name:
BDBM208976
Synonyms:
US11040980, Example 19a US9994576, 19a
Type:
Small organic molecule
Emp. Form.:
C34H35FN8O3
Mol. Mass.:
622.6919
SMILES:
CC(C)(C=C(C#N)C(=O)N1CCC[C@H]1Cn1nc(-c2ccc(Oc3ccccc3)cc2F)c2c(N)ncnc12)N1CC2(COC2)C1
: