Target
Fructose-1,6-bisphosphatase 1
Ligand
BDBM50316378
Substrate
Meas. Tech.
Spectrophotometrical Assay
pH
7.5±n/a
IC50
1500±100 nM
Comments
extracted
Citation
 Kantrowitz, ERHeng, S Dibenzofuran derivatives as inhibitors of fructose 1,6-bisphosphatase and methods of use thereof US Patent  US9273021 Publication Date 3/1/2016 
Target
Name:
Fructose-1,6-bisphosphatase 1
Synonyms:
F16P1_PIG FBP1 Fructose-1,6-bisphosphatase 1 (FBPase)
Type:
Protein
Mol. Mass.:
36781.07
Organism:
Sus scrofa (Pig)
Description:
Liver FBPase (P00636)
Residue:
338
  
Inhibitor
Name:
BDBM50316378
Synonyms:
1,1'-(1,3,7,9-Tetrahydroxydibenzofuran-2,6-diyl)bis(3-methylbutan-1-one) US9273021, 3
Type:
Small organic molecule
Emp. Form.:
C22H24O7
Mol. Mass.:
400.4218
SMILES:
CC(C)CC(=O)c1c(O)cc2oc3c(C(=O)CC(C)C)c(O)cc(O)c3c2c1O
: