Target
Aurora kinase A
Ligand
BDBM16011
Substrate
Meas. Tech.
In Vitro Aurora A Activity Assay (DiscoverX)
pH
7.4±n/a
Temperature
298.15±n/a K
IC50
11.3±1.7 nM
Comments
extracted
Citation
 Sebti, SMSchönbrunn, ELawrence, NJLawrence, HRMartin, MP Aurora kinase inhibitors and methods of making and using thereof US Patent  US9249124 Publication Date 2/2/2016 
Target
Name:
Aurora kinase A
Synonyms:
AIK ARK-1 AURA AURKA_HUMAN Aurora 2 Aurora kinase A (AURKA) Aurora kinase A (Aurora-2) Aurora/IPL1-related kinase 1 Breast tumor-amplified kinase IAK1 STK15 GN Serine/threonine kinase 15 Serine/threonine-protein kinase 6 Serine/threonine-protein kinase aurora-A aurora-2 | hARK1
Type:
Serine/threonine-protein kinase
Mol. Mass.:
45830.98
Organism:
Homo sapiens (Human)
Description:
O14965
Residue:
403
  
Inhibitor
Name:
BDBM16011
Synonyms:
2-{[5-fluoro-2-(phenylamino)pyrimidin-4-yl]amino}benzoic acid Bisanilinopyrimidine, 3m | US9249124, 14
Type:
Small organic molecule
Emp. Form.:
C17H13FN4O2
Mol. Mass.:
324.3091
SMILES:
OC(=O)c1ccccc1Nc1nc(Nc2ccccc2)ncc1F
: