Target
Aurora kinase A
Ligand
BDBM92812
Substrate
Meas. Tech.
In Vitro Aurora A Activity Assay (DiscoverX)
pH
7.4±n/a
Temperature
298.15±n/a K
IC50
4.0±0.2 nM
Comments
extracted
Citation
 Sebti, SMSchönbrunn, ELawrence, NJLawrence, HRMartin, MP Aurora kinase inhibitors and methods of making and using thereof US Patent  US9249124 Publication Date 2/2/2016 
Target
Name:
Aurora kinase A
Synonyms:
AIK ARK-1 AURA AURKA_HUMAN Aurora 2 Aurora kinase A (AURKA) Aurora kinase A (Aurora-2) Aurora/IPL1-related kinase 1 Breast tumor-amplified kinase IAK1 STK15 GN Serine/threonine kinase 15 Serine/threonine-protein kinase 6 Serine/threonine-protein kinase aurora-A aurora-2 | hARK1
Type:
Serine/threonine-protein kinase
Mol. Mass.:
45830.98
Organism:
Homo sapiens (Human)
Description:
O14965
Residue:
403
  
Inhibitor
Name:
BDBM92812
Synonyms:
Bisanilinopyrimidine, 6e | US9249124, 28
Type:
Small molecule
Emp. Form.:
C18H16N4O3
Mol. Mass.:
336.3446
SMILES:
COc1ccccc1Nc1ccnc(Nc2ccc(cc2)C(O)=O)n1
: