Target
Aurora kinase A
Ligand
BDBM92838
Substrate
Meas. Tech.
In Vivo Aurora A inhibitory Assay ( MDA-MB-468)
Temperature
310.15±n/a K
IC50
<1±n/a nM
Comments
extracted
Citation
 Sebti, SMSchönbrunn, ELawrence, NJLawrence, HRMartin, MP Aurora kinase inhibitors and methods of making and using thereof US Patent  US9249124 Publication Date 2/2/2016 
Target
Name:
Aurora kinase A
Synonyms:
AIK ARK-1 AURA AURKA_HUMAN Aurora 2 Aurora kinase A (AURKA) Aurora kinase A (Aurora-2) Aurora/IPL1-related kinase 1 Breast tumor-amplified kinase IAK1 STK15 GN Serine/threonine kinase 15 Serine/threonine-protein kinase 6 Serine/threonine-protein kinase aurora-A aurora-2 | hARK1
Type:
Serine/threonine-protein kinase
Mol. Mass.:
45830.98
Organism:
Homo sapiens (Human)
Description:
O14965
Residue:
403
  
Inhibitor
Name:
BDBM92838
Synonyms:
Bisanilinopyrimidine, 9j | US9249124, 54
Type:
Small molecule
Emp. Form.:
C20H19ClFN5O
Mol. Mass.:
399.849
SMILES:
Fc1cnc(Nc2ccc(cc2)N2CCOCC2)nc1Nc1ccccc1Cl
: