Target
Aurora kinase A
Ligand
BDBM87052
Substrate
Meas. Tech.
Protein Crystallography Inhibitory Activity Assay
pH
7.4±n/a
Temperature
291.15±n/a K
IC50
3.7±0.7 nM
Comments
extracted
Citation
 Sebti, SMSchönbrunn, ELawrence, NJLawrence, HRMartin, MP Aurora kinase inhibitors and methods of making and using thereof US Patent  US9249124 Publication Date 2/2/2016 
Target
Name:
Aurora kinase A
Synonyms:
AIK ARK-1 AURA AURKA_HUMAN Aurora 2 Aurora kinase A (AURKA) Aurora kinase A (Aurora-2) Aurora/IPL1-related kinase 1 Breast tumor-amplified kinase IAK1 STK15 GN Serine/threonine kinase 15 Serine/threonine-protein kinase 6 Serine/threonine-protein kinase aurora-A aurora-2 | hARK1
Type:
Serine/threonine-protein kinase
Mol. Mass.:
45830.98
Organism:
Homo sapiens (Human)
Description:
O14965
Residue:
403
  
Inhibitor
Name:
BDBM87052
Synonyms:
Bisanilinopyrimidine inhibitor, 6 US9249124, 24
Type:
Small organic molecule
Emp. Form.:
C17H13FN4O2
Mol. Mass.:
324.3091
SMILES:
OC(=O)c1ccc(Nc2nccc(Nc3ccccc3F)n2)cc1
: