Target
Aurora kinase A
Ligand
BDBM92800
Substrate
Meas. Tech.
Protein Crystallography Inhibitory Activity Assay
pH
7.4±n/a
Temperature
291.15±n/a K
IC50
0.8±0.2 nM
Comments
extracted
Citation
 Sebti, SMSchönbrunn, ELawrence, NJLawrence, HRMartin, MP Aurora kinase inhibitors and methods of making and using thereof US Patent  US9249124 Publication Date 2/2/2016 
Target
Name:
Aurora kinase A
Synonyms:
AIK ARK-1 AURA AURKA_HUMAN Aurora 2 Aurora kinase A (AURKA) Aurora kinase A (Aurora-2) Aurora/IPL1-related kinase 1 Breast tumor-amplified kinase IAK1 STK15 GN Serine/threonine kinase 15 Serine/threonine-protein kinase 6 Serine/threonine-protein kinase aurora-A aurora-2 | hARK1
Type:
Serine/threonine-protein kinase
Mol. Mass.:
45830.98
Organism:
Homo sapiens (Human)
Description:
O14965
Residue:
403
  
Inhibitor
Name:
BDBM92800
Synonyms:
Bisanilinopyrimidine, 3o | US9249124, 16
Type:
Small molecule
Emp. Form.:
C17H12ClFN4O2
Mol. Mass.:
358.754
SMILES:
OC(=O)c1ccc(Nc2ncc(F)c(Nc3ccccc3Cl)n2)cc1
: