Target
Prostaglandin D2 receptor 2
Ligand
BDBM210750
Substrate
Meas. Tech.
Radioligand Binding Assay
pH
7.4±n/a
Temperature
323.15±n/a K
Ki
6.504±n/a nM
Comments
extracted
Citation
 Huang, XPalani, ARao, AUZhang, HZhou, W Substituted isoquinolines as CRTH2 receptor modulators US Patent  US9290454 Publication Date 3/22/2016 
Target
Name:
Prostaglandin D2 receptor 2
Synonyms:
CD_antigen=CD294 Chemoattractant Receptor-homologous molecule expressed on T-helper type 2 cells (CRTH2) Chemoattractant receptor-homologous molecule expressed on Th2 cells (CRTH2) G protein-coupled receptor 44 GPR44 PTGDR2 Prostaglandin D2 receptor 2 | Prostaglandin D2 receptor 2 (PGD2)
Type:
Enzyme
Mol. Mass.:
43295.45
Organism:
Homo sapiens (Human)
Description:
Q9Y5Y4
Residue:
395
  
Inhibitor
Name:
BDBM210750
Synonyms:
US9290454, 3.2
Type:
Small organic molecule
Emp. Form.:
C31H28F2N2O4
Mol. Mass.:
530.5618
SMILES:
OC(=O)CCCCc1cc2cc(ccc2c(=O)n1-c1ccc(F)cc1)C(=O)N[C@@H]1CCCc2cc(F)ccc12
: