Target
Prostaglandin D2 receptor 2
Ligand
BDBM210751
Substrate
Meas. Tech.
Radioligand Binding Assay
pH
7.4±n/a
Temperature
323.15±n/a K
Ki
8.202±n/a nM
Comments
extracted
Citation
 Huang, XPalani, ARao, AUZhang, HZhou, W Substituted isoquinolines as CRTH2 receptor modulators US Patent  US9290454 Publication Date 3/22/2016 
Target
Name:
Prostaglandin D2 receptor 2
Synonyms:
CD_antigen=CD294 Chemoattractant Receptor-homologous molecule expressed on T-helper type 2 cells (CRTH2) Chemoattractant receptor-homologous molecule expressed on Th2 cells (CRTH2) G protein-coupled receptor 44 GPR44 PTGDR2 Prostaglandin D2 receptor 2 | Prostaglandin D2 receptor 2 (PGD2)
Type:
Enzyme
Mol. Mass.:
43295.45
Organism:
Homo sapiens (Human)
Description:
Q9Y5Y4
Residue:
395
  
Inhibitor
Name:
BDBM210751
Synonyms:
US9290454, 3.3
Type:
Small organic molecule
Emp. Form.:
C30H29FN2O5
Mol. Mass.:
516.5601
SMILES:
COc1ccc(cc1)-n1c(CCCCC(O)=O)cc2cc(ccc2c1=O)C(=O)N[C@H](C)c1ccc(F)cc1
: