Target
Prostaglandin D2 receptor 2
Ligand
BDBM210762
Substrate
Meas. Tech.
Radioligand Binding Assay
pH
7.4±n/a
Temperature
323.15±n/a K
Ki
25.45±n/a nM
Comments
extracted
Citation
 Huang, XPalani, ARao, AUZhang, HZhou, W Substituted isoquinolines as CRTH2 receptor modulators US Patent  US9290454 Publication Date 3/22/2016 
Target
Name:
Prostaglandin D2 receptor 2
Synonyms:
CD_antigen=CD294 Chemoattractant Receptor-homologous molecule expressed on T-helper type 2 cells (CRTH2) Chemoattractant receptor-homologous molecule expressed on Th2 cells (CRTH2) G protein-coupled receptor 44 GPR44 PTGDR2 Prostaglandin D2 receptor 2 | Prostaglandin D2 receptor 2 (PGD2)
Type:
Enzyme
Mol. Mass.:
43295.45
Organism:
Homo sapiens (Human)
Description:
Q9Y5Y4
Residue:
395
  
Inhibitor
Name:
BDBM210762
Synonyms:
US9290454, 6.2
Type:
Small organic molecule
Emp. Form.:
C31H25F2N3O5
Mol. Mass.:
557.5441
SMILES:
CC1(CC(=NO1)c1ccc2c(cc(CCCCC(O)=O)n(-c3ccc(F)cc3)c2=O)c1)c1nc2ccc(F)cc2o1
: