Target
Beta-secretase 1 [1-454]
Ligand
BDBM210886
Substrate
Meas. Tech.
Fluorescence Quench Assay
pH
4.4±n/a
IC50
16.3±n/a nM
Comments
extracted
Citation
 Venkatraman, SYuan, JZheng, Y Inhibitors of β-secretase US Patent  US9290477 Publication Date 3/22/2016 
Target
Name:
Beta-secretase 1 [1-454]
Synonyms:
BACE BACE1_HUMAN KIAA1149
Type:
Protein
Mol. Mass.:
50294.92
Organism:
Homo sapiens (Human)
Description:
Human BACE1 truncation (1-454 aa)
Residue:
454
  
Inhibitor
Name:
BDBM210886
Synonyms:
US9290477, 4
Type:
Small organic molecule
Emp. Form.:
C19H24BrN3O
Mol. Mass.:
390.317
SMILES:
CO[C@H]1CC[C@@]2(Cc3ccc(Br)cc3C22N=C(C)C(N)=N2)C[C@@H]1C
: