Target
Cytochrome P450 2C8
Ligand
BDBM211757
Substrate
Meas. Tech.
Cytochrome P450 2C9 Inhibition Assay (Amodiaquine)
Temperature
310.15±n/a K
IC50
>50000±n/a nM
Comments
extracted
Citation
 Gnamm, COost, TPeters, SHoesch, HRies, UJ Substituted bicyclic dihydropyrimidinones and their use as inhibitors of neutrophil elastase activity US Patent  US9290459 Publication Date 3/22/2016 
Target
Name:
Cytochrome P450 2C8
Synonyms:
CP2C8_HUMAN CYPIIC8 P450 IIC2 P450 form 1 | S-mephenytoin 4-hydroxylase
Type:
Protein
Mol. Mass.:
55839.23
Organism:
Homo sapiens (Human)
Description:
P10632
Residue:
490
  
Inhibitor
Name:
BDBM211757
Synonyms:
US9290459, 10A US9670166, 10A
Type:
Small organic molecule
Emp. Form.:
C22H16F3N3O4S
Mol. Mass.:
475.44
SMILES:
CS(=O)(=O)c1cc(ccc1[C@H]1NC(=O)N(C2=C1C(=O)CC2)c1cccc(c1)C(F)(F)F)C#N
: