Target
Glycogen [starch] synthase, muscle
Ligand
BDBM212171
Substrate
Meas. Tech.
Glycogen Synthase Activity Assay
pH
7.3±n/a
Temperature
303.15±n/a K
EC50
100±n/a nM
Comments
extracted
Citation
 Nakagawa, TMatsumoto, KTakeshita, SYoshida, TTokumasu, MInoue, HKobayashi, K Pharmaceutical composition for treating diabetes US Patent  US9290487 Publication Date 3/22/2016 
Target
Name:
Glycogen [starch] synthase, muscle
Synonyms:
GYS GYS1_HUMAN Glycogen synthase (GYS1) | Muscle glycogen synthase
Type:
Enzyme
Mol. Mass.:
83779.52
Organism:
Homo sapiens (Human)
Description:
P13807
Residue:
737
  
Inhibitor
Name:
BDBM212171
Synonyms:
US9290487, compound of Ex. 18
Type:
Small organic molecule
Emp. Form.:
C28H23F2NO5
Mol. Mass.:
491.4827
SMILES:
OC(=O)[C@@H]1CCCN1C(=O)c1cccc(COc2ccc(cc2)-c2cc(F)c(F)c3C=CCOc23)c1
: