Target
Glycogen [starch] synthase, muscle
Ligand
BDBM212190
Substrate
Meas. Tech.
Glycogen Synthase Activity Assay
pH
7.3±n/a
Temperature
303.15±n/a K
EC50
29±n/a nM
Comments
extracted
Citation
 Nakagawa, TMatsumoto, KTakeshita, SYoshida, TTokumasu, MInoue, HKobayashi, K Pharmaceutical composition for treating diabetes US Patent  US9290487 Publication Date 3/22/2016 
Target
Name:
Glycogen [starch] synthase, muscle
Synonyms:
GYS GYS1_HUMAN Glycogen synthase (GYS1) | Muscle glycogen synthase
Type:
Enzyme
Mol. Mass.:
83779.52
Organism:
Homo sapiens (Human)
Description:
P13807
Residue:
737
  
Inhibitor
Name:
BDBM212190
Synonyms:
US9290487, compound of Ex. 38
Type:
Small organic molecule
Emp. Form.:
C26H23F2NO4S
Mol. Mass.:
483.527
SMILES:
CSc1cc(F)c(F)cc1-c1ccc(OCc2cccc(c2)C(=O)N2CCC[C@H]2C(O)=O)cc1
: