Target
Glycogen [starch] synthase, muscle
Ligand
BDBM212201
Substrate
Meas. Tech.
Glycogen Synthase Activity Assay
pH
7.3±n/a
Temperature
303.15±n/a K
EC50
220±n/a nM
Comments
extracted
Citation
 Nakagawa, TMatsumoto, KTakeshita, SYoshida, TTokumasu, MInoue, HKobayashi, K Pharmaceutical composition for treating diabetes US Patent  US9290487 Publication Date 3/22/2016 
Target
Name:
Glycogen [starch] synthase, muscle
Synonyms:
GYS GYS1_HUMAN Glycogen synthase (GYS1) | Muscle glycogen synthase
Type:
Enzyme
Mol. Mass.:
83779.52
Organism:
Homo sapiens (Human)
Description:
P13807
Residue:
737
  
Inhibitor
Name:
BDBM212201
Synonyms:
US9290487, compound of Ex. 49
Type:
Small organic molecule
Emp. Form.:
C28H25F2NO6
Mol. Mass.:
509.498
SMILES:
CC(=O)COc1cc(cc(F)c1F)-c1ccc(OCc2cccc(c2)C(=O)N2CCC[C@H]2C(O)=O)cc1
: