Target
Amyloid-beta precursor protein
Ligand
BDBM26658
Substrate
Meas. Tech.
Thioflavin-T (Th-T) Fluorescence Assay
pH
7.4±n/a
Temperature
298.15±n/a K
IC50
3.03e+4±n/a nM
Comments
extracted
Citation
 Sato, MMurakami, KUno, MNakagawa, YKatayama, SAkagi, KMasuda, YTakegoshi, KIrie, K Site-specific inhibitory mechanism for amyloid ß42 aggregation by catechol-type flavonoids targeting the Lys residues. J Biol Chem 288:23212-24 (2013)  
Target
Name:
Amyloid-beta precursor protein
Synonyms:
A4 ABPP AICD-50 AICD-59 AID(57) APP Alzheimer disease amyloid protein Amyloid beta Protein Amyloid beta protein Abeta(1-42) Amyloid intracellular domain 57 Amyloid protein (Abeta42b) Beta amyloid A4 protein Beta-APP42 Beta-amyloid protein 42 C83 CVAP Gamma Secretase Gamma-CTF(57) Gamma-secretase Gamma-secretase C-terminal fragment 57 P3(40) PN-II Protease nexin-II S-APP-beta Soluble APP-beta | beta-Amyloid Precursor Protein (APP)
Type:
Single-pass type I membrane protein
Mol. Mass.:
86890.41
Organism:
Homo sapiens (Human)
Description:
P05067
Residue:
770
  
Inhibitor
Name:
BDBM26658
Synonyms:
2-(2,4-dihydroxyphenyl)-3,5,7-trihydroxy-1-benzopyran-4-one 2-(2,4-dihydroxyphenyl)-3,5,7-trihydroxy-chromone 2-[2,4-bis(oxidanyl)phenyl]-3,5,7-tris(oxidanyl)chromen-4-one MLS000069618 Morin (5) SMR000058259 morin
Type:
Flavonoid
Emp. Form.:
C15H10O7
Mol. Mass.:
302.2357
SMILES:
Oc1ccc(c(O)c1)-c1oc2cc(O)cc(O)c2c(=O)c1O
: